パソコンが立ち上がったら、いきなりMicrosoft JScript コンパイルエラー ';'がありませんというようなエラーが出るのですが、どう対処すればいいでしょうか。どうかおしえていただければ助かります。

A 回答 (3件)

パソコンが立ち上がったらってことはスタートアップ関係での自動起動しているアプリだと思うけど


その中で「JScript」関係の物はないか調べる。

JScriptはJavaScriptをマイクロソフトが独自拡張した物。
ちなみにJavaScriptとJavaはまったくの別物。混同している人って未だに結構いる。
(自称プロの某回答者もその違いすら理解できてないほどみたいですね)
Java Runtimeの再インストールをやったりしたところでJScript関係の問題は絶対に解決しない。

この回答への補足

ご回答ありがとうございます。
調べる方法を詳しく教えていただけますでしょうか~。よろしくお願いいたたします。

補足日時:2011/02/23 13:33
    • good
    • 0

とりあえず、Java Runtime のアップデートをしてみたほうがいいと思う。


http://www.java.com/ja/download/


それでだめなら、

参考:http://detail.chiebukuro.yahoo.co.jp/qa/question …

を確認してみましょう。
根本的な解決ではないが改善はすると思う。


ネットで検索するとあちこちに似たような問題を抱えている人がいる模様。
エラーが出ることよりも、起動時になぜ JScript が走るのかが謎。
    • good
    • 0
この回答へのお礼

ご回答ありがとうございます。やってみます。

お礼日時:2011/03/07 22:30

そのパソコンを新しく購入した時には、そのエラーはでません。



ご質問者さまが、何かをインストールしたり、設定変更をしたことがきっかけとなって、
エラーが出るようになったはずです。

そのきっかけになるような操作としては、具体的に何をしましたか?


 この情報がはっきりしないと、対策がとれません。
    • good
    • 0
この回答へのお礼

ご回答ありがとうございます。毎日よくパソコンを弄ったりしていますので、何のソフトをインストールしたのかも覚えていないです>・<

お礼日時:2011/03/07 22:21

お探しのQ&Aが見つからない時は、教えて!gooで質問しましょう!

このQ&Aを見た人が検索しているワード

このQ&Aと関連する良く見られている質問

Qmultiple definitionというエラー

現在Ubuntu LinuxのgccでC言語のプログラムをやっています。

https://sourceforge.jp/projects/cc1101driver/scm/svn/blobs/2452/trunk/20140411/code.h

このツリーのcode.hに ”const sig_code2_t PVC_TCP_SIG_CODE[100] = {” というコードを追加してmakeを行うと次のようなエラーが出て実行ファイルが出力されません。



(エラー内容)

---------------(中略)-----------------
gcc -o exe main.o event.o env.o audio.o task.o comm.o menu_show_status.o mount.o net.o misc.o -lpthread
event.o:(.rodata+0x0): multiple definition of `PVC_TCP_SIG_CODE'
main.o:(.rodata+0x0): first defined here
env.o:(.rodata+0x0): multiple definition of `PVC_TCP_SIG_CODE'
main.o:(.rodata+0x0): first defined here
audio.o:(.rodata+0x0): multiple definition of `PVC_TCP_SIG_CODE'
main.o:(.rodata+0x0): first defined here
task.o:(.rodata+0x0): multiple definition of `PVC_TCP_SIG_CODE'
main.o:(.rodata+0x0): first defined here
comm.o:(.rodata+0x0): multiple definition of `PVC_TCP_SIG_CODE'
main.o:(.rodata+0x0): first defined here
mount.o:(.rodata+0x0): multiple definition of `PVC_TCP_SIG_CODE'
main.o:(.rodata+0x0): first defined here
net.o:(.rodata+0x0): multiple definition of `PVC_TCP_SIG_CODE'
main.o:(.rodata+0x0): first defined here
misc.o:(.rodata+0x0): multiple definition of `PVC_TCP_SIG_CODE'
main.o:(.rodata+0x0): first defined here
collect2: error: ld returned 1 exit status
make: *** [exe] Error 1






この const sig_code2_t PVC_TCP_SIG_CODE[100] = {をコメントアウト正常にビルドできるのですが、




この問題を解決するにはどうすれば良いのかご教示頂きますようお願い致します。

現在Ubuntu LinuxのgccでC言語のプログラムをやっています。

https://sourceforge.jp/projects/cc1101driver/scm/svn/blobs/2452/trunk/20140411/code.h

このツリーのcode.hに ”const sig_code2_t PVC_TCP_SIG_CODE[100] = {” というコードを追加してmakeを行うと次のようなエラーが出て実行ファイルが出力されません。



(エラー内容)

---------------(中略)-----------------
gcc -o exe main.o event.o env.o audio.o task.o comm.o menu_show_status.o mount.o net.o misc.o -lpthread
event.o:(.rodat...続きを読む

Aベストアンサー

お約束の「ヘッダに実体を定義してはいけない」ってヤツです。

code.hに記述した内容はall_includes.hに適用されます。
all_includes.h内で#include "code.h"していますからね。

で、all_includes.hの内容はそれぞれ
audio.c、comm.c、env.c、event.c、main.c、misc.c、mount.c、net.c、task.cに適用されます。
つまり、code.hに記述した内容も
audio.c、comm.c、env.c、event.c、main.c、misc.c、mount.c、net.c、task.cに適用されます。
それぞれのオブジェクトファイルにPVC_TCP_SIG_CODE[100]が存在します。

リンクする段階でどのオブジェクトファイルのPVC_TCP_SIG_CODE[100]を使用したらいいのでしょうか?????
というエラーです。

extern宣言して、実体をどこかのソースファイルのみに記述する。
というのが一般的な対処方法です。
# static宣言にすればとりあえずリンクは通るかもしれませんが…無駄が出ますねぇ。
# 今回はconstなので、メモリに無駄が出るだけ…で済むかと思われますが。
http://d.hatena.ne.jp/saitodevel01/20110321/1300685958

お約束の「ヘッダに実体を定義してはいけない」ってヤツです。

code.hに記述した内容はall_includes.hに適用されます。
all_includes.h内で#include "code.h"していますからね。

で、all_includes.hの内容はそれぞれ
audio.c、comm.c、env.c、event.c、main.c、misc.c、mount.c、net.c、task.cに適用されます。
つまり、code.hに記述した内容も
audio.c、comm.c、env.c、event.c、main.c、misc.c、mount.c、net.c、task.cに適用されます。
それぞれのオブジェクトファイルにPVC_TCP_SIG_CODE[100]が存在します。...続きを読む

QGCCのコンパイルエラー

マイコンのコンパイルの際に

error: 3664.h: No such file or directory

と表示されます。
他のサイトで必要なファイルが欠損している、ということは分かりました。
ターゲットファイル等はあります。
フォルダの中に納まっています。
何が問題なのでしょうか?

Aベストアンサー

ingenuity さん こんばんは、

error: 3664.h: No such file or directory

でわたしもあっちこっちググリましたが其れらしい回答があるサイトを発見しました。

1.まずerrorの「3664.h」というのはCコンパイラが必要とするヘッダ・ファイルです。
2.それに3664というヘッダ・ファイルを使用するターゲットマシンはAKI-H8/3664以外に
  ないということです。(秋月電子通商さんのH8/CPUキットの紹介ページ
              http://0n0.fc2web.com/h83664/index.html)
3.この中でGCCコンパイラを使用したH8CPUの組込マイコンソフトウェア開発話が出てきます。
4.このコンパイラはWin系でもLinux系でも両方使えますので、あなたが構築している開発
  環境を今一度ご確認ください。
5.また
    error: 3664.h: No such file or directory
  というエラーメッセージの意味は
  「コマンドラインでgccコンパイラにコンパイル要求を出したが、gccコンパイラが
   コンパイルする前にインクルードせよとプログラムに書かれているインクルード
   ファイルをパスにそってgccコンパイラが探しにいったがディレクトリのなかをさ 
   がしてもみつかりませんのでコンパイルを中止しました。」というgccコンパイラ
   からのエラーメッセージです。
6.ここで
   「ターゲットファイル等はあります。フォルダの中に納まっています。
    何が問題なのでしょうか?」とありますが先ほどのサイトでも実際にコンパイル
    できていますね。なので、パスが切られていない可能性が考えられます。
    (コンパイルする環境のパスが切られていないことが原因かも知れません。)
7.いちどディレクトリファイルではなく、おなじソース上にこの問題のヘッダ・ファイル
  をソースに書き込んでコンパイルされてはいかがでしょうか?(makeなんかでは
  こんなことはよろしくないのですが、JAVAでもインポートできないファイルはこのよう
  に書くことがあります。よくない傾向ではありますが)

いちどお試しください  

参考URL:http://0n0.fc2web.com/h83664/index.html

ingenuity さん こんばんは、

error: 3664.h: No such file or directory

でわたしもあっちこっちググリましたが其れらしい回答があるサイトを発見しました。

1.まずerrorの「3664.h」というのはCコンパイラが必要とするヘッダ・ファイルです。
2.それに3664というヘッダ・ファイルを使用するターゲットマシンはAKI-H8/3664以外に
  ないということです。(秋月電子通商さんのH8/CPUキットの紹介ページ
              http://0n0.fc2web.com/h83664/index.html)
3.この中でGCCコンパイ...続きを読む

QCarbon Copy Cloner Error code: 51

MacBookProをCarbon Copy Clornerで外付けのHDDにBackUp(4回)しました。4回とも同じ問題で止まってしまいました。

”最終段階でバックアップ中に問題が発生しました。”

Error code: 51

でCompleteしません。
環境はOS Tiger 10.4.11, 外付けのHDDはLaCie 160GBでFirewireで接続しています。

以下にlogの問題があると思われる箇所をコピーします。
是非、解決策を教えてください。
お願いいたします。

--------------copy------------------
16:22:34Warning user about performing a destructive action.
16:22:36User chose to proceed with destructive action.
16:22:36コピー先ボリュームの所有権を有効にしています...
16:22:43コピー先ボリュームの所有権が有効になりました。
16:22:43コピー先ボリュームのアクセス制御リストが有効になりました。
16:22:43コピー元ボリュームへの排他アクセスを確認しています...
16:22:43Aborting block-level clone, starting over with file-level clone.
16:22:43検証しています...
16:22:43同期エンジンを初期化しています...
16:22:44クローンを作成しています...
18:00:24CCC はコピー先ボリュームのアクセス制御リストを有効にすることができませんでした。
18:00:26CCC はコピー先ボリュームのアクセス制御リストを有効にすることができませんでした。
18:03:11rsync error: some files/attrs were not transferred (see previous errors) (code 23) at /Volumes/Home/Users/bombich/Development/Bombich_Software/rsync-3.0.5pre2/main.c(1047) [sender=3.0.5pre2] (51)
18:03:12rsync: バックアップ中に問題が発生しました。, Error code: 51
18:03:13Sync Engine warnings: (
"rsync: set_acl: sys_acl_set_file(Volumes/iDisk, ACL_TYPE_EXTENDED): Operation not supported (45)",
"rsync: set_acl: sys_acl_set_file(Volumes/iDisk, ACL_TYPE_EXTENDED): Operation not supported (45)",
"rsync error: some files/attrs were not transferred (see previous errors) (code 23) at /Volumes/Home/Users/bombich/Development/Bombich_Software/rsync-3.0.5pre2/main.c(1047) [sender=3.0.5pre2]"
)
================================================================================

MacBookProをCarbon Copy Clornerで外付けのHDDにBackUp(4回)しました。4回とも同じ問題で止まってしまいました。

”最終段階でバックアップ中に問題が発生しました。”

Error code: 51

でCompleteしません。
環境はOS Tiger 10.4.11, 外付けのHDDはLaCie 160GBでFirewireで接続しています。

以下にlogの問題があると思われる箇所をコピーします。
是非、解決策を教えてください。
お願いいたします。

--------------copy------------------
16:22:34Warning user about performing a destru...続きを読む

Aベストアンサー

まずマルチはやめてください.

昨日も使いましたが
CCCの最新バージョンは3.1.3です.
開始前にアクセス権の修復.できればシステムディスクで起動してディスクの修復とアクセス権の修復.
LacieはGUIDパーティションですよね.
オプションでコピー先ボリュームを消去.

Qエクセル マクロ が他のPCでコンパイル エラー

作成してもらったマクロです、作成者多忙で修正は即不可ですので、何とか解決したいのですが自分はマクロを理解できないので、どなたか教えてください。
症状は現在(仮りにAとします)WinXPで正常に動いております(エクセル2000)このソフトをLAN(仮称B エクセル2003)でも使用しておりましたが、LANでエラー発生。ほか(仮称 C、D)などにAからデータとソフトをコピーしてもエラー発生、現状はAではつかえてますがLANで使いたいので、、

全部のソースは文字数の関係で貼り付け不可ですので エラーらしきところを張りつけます「エラーは非表示モジュラー1でコンパイルエラー」です
1行目で黄色反転して11行目でとまってます。

Private Sub WorkSheet_Delete(Target_Sheet0 As String) 'シート削除
'ActiveBookのシート「Target_Sheet0」があれば「削除」、
'無ければそのまま
'無い物を削除実行はアラーム表示となるので
On Error GoTo ErrSheetDelete
Application.DisplayAlerts = False
Worksheets(Target_Sheet0).Delete
Application.DisplayAlerts = True
GoTo ExitSheetDelete
ErrSheetDelete:
Error_Number = Err.Number ' その後、オートメーション エラーの発生を調べます。
Msg = "仮台帳がアクティブにできませんSub WorkSheet_Delete。Error_Number=" & Error_Number
Err.Clear ' Err オブジェクトのプロパティをクリアします。
ExitSheetDelete: '
'Stop
End Sub

作成してもらったマクロです、作成者多忙で修正は即不可ですので、何とか解決したいのですが自分はマクロを理解できないので、どなたか教えてください。
症状は現在(仮りにAとします)WinXPで正常に動いております(エクセル2000)このソフトをLAN(仮称B エクセル2003)でも使用しておりましたが、LANでエラー発生。ほか(仮称 C、D)などにAからデータとソフトをコピーしてもエラー発生、現状はAではつかえてますがLANで使いたいので、、

全部のソースは文字数の関係で貼り付け不可...続きを読む

Aベストアンサー

Microsoft Officeのマクロはある時期に仕様がガラッと変わりました。
そのバージョンは忘れてしまいましたがご使用のバージョンあたりが怪しい。

仕様変更が原因だった場合、マクロに詳しい人でないと対処不可能です。
自動変換ツールもありますが万能ではないのであてには出来ません。
というか、2003で開いた時それっぽいメッセージが表示されませんか?

バージョンが原因でないとしても「On Error GoTo ~」が使用されているのでエラーの出た場所が原因とは限りません。特にエラーフックかけているのに「On Error GoTo 0」で解除していませんからね。これだけ見せられても解読不可能です。全体を見ないことには…

と言うことで、マクロを理解していない人に対してここで解決に導くことは出来ません。
対処してもらえるまでは正常に動作するパソコンを借りて急場をしのいでください。

Qcanon PIXUS MP600 エラーコード6B00

電源を入れると、ディスプレイにエラー 6B00 プリンタトラブルが発生しましたと表示され、それ以降まったく動作しません、プリンタカバーを開けてもプリントヘッドが交換位置に移動しません。
メーカーへは問い合わせ済みです。
出来れば、自分で修理したいのですが、推測される原因、修理方法等
教えていただけないでしょうか?
googleでcanon error 6B00で検索したところ何点かヒットしましたが、外国語でいまいちわかりません。
よろしくお願いします。

Aベストアンサー

プリンタの修理屋です。

英語には自信はありませんけど、大体の意味は「ヘッドの下の辺りに、何か遺物が引っかかっていることがあるので、プリンタをさかさまにして振ってみてください」で良いと思います。
実はこの作業に関しては、(別の故障の対応として)このカテで紹介しているのですが、今回のエラーに関しては無関係と考えても良いでしょう。

エラーそのものは紙送りモーターの動作不良ですが、メインの紙送りではなく、シートフィーダー内のモーターのようです。
原因としてはモーター不良か、メイン基板の不良になるようです。
実はモーター単品の部品設定は無く、シートフィーダーの交換になります。

おそらく、英文の案内は紙の破片がギアに噛み込んでモーターが回らないことを想定しているのでしょうけど、場所から考えてそういったものが入っていくようなところではないでしょう。
紙が詰まったときに無理矢理引き抜いたとか、エアダスターでやたらに吹きまくった等でなければ、トラブルが起こることも考えにくいですね。

このユニットを交換するためにはが外装カバーをすべて外し、メカユニット自体をおろ差無ければ出来ない作業です。
メイン基板が壊れているとしたら、廃インク吸収体の交換も必要になるケースもあります。
(No2さんが言っているパッドは正式には廃インク吸収体といって、メカユニットの下に仕込まれています。ここまでバラすのが大変です)

メイン基板に廃インクの量が記録されています。そのデーターを持ち越すことが出来ないので、一定の量(若干の余裕を持たせています)を超えていたら交換が必要になるわけです。

プリンタの修理屋です。

英語には自信はありませんけど、大体の意味は「ヘッドの下の辺りに、何か遺物が引っかかっていることがあるので、プリンタをさかさまにして振ってみてください」で良いと思います。
実はこの作業に関しては、(別の故障の対応として)このカテで紹介しているのですが、今回のエラーに関しては無関係と考えても良いでしょう。

エラーそのものは紙送りモーターの動作不良ですが、メインの紙送りではなく、シートフィーダー内のモーターのようです。
原因としてはモーター不良か、メ...続きを読む

QVisualStudio2008 で iostream.h が見つからないコンパイルエラーは?

VisualStudio2008 でVisual C++コンソールアプリのプロジェクトを開きましたが、ヘッダーファイル たとえばiostream.hが見つからないというコンパイルエラーはどこの設定を変更すればよろしいのでしょうか。

Aベストアンサー

ソースコードで #include <iostream.h> と書いているのを #include <iostream> に修正する。

QNode.jsのWebプログラム(javascript)からの呼び出し

Webプログラム(javascript)から、RS-232C接続のデータを取得する事を検討しています。

それには、以下に記述されているNode.jsを使用すれば、RS-232Cのデータが取得できる分かったのですが、
【Node.jsでRS232C通信を試してみる - undefined】
http://blog.bokuweb.me/entry/node-serial

これを実行するには、コマンドプロンプトから
node xxx.js
で起動しないと、Node.jsのモジュールが利用できないのではと考えています。

これを、コマンドプロンプトから起動するのではなく、Webプログラムのjavascriptから呼び出すには、どのようにすればいいのでしょうか。

ご教授下さい。

以上。よろしくお願い致します。

Aベストアンサー

Web プログラムの形態が不明なので、少々答えづらいのですが。

案1.
node.js で、シリアルポートを叩いた結果を JSON 形式で出力する単独プログラムを用意
"Web プログラム" のサーバー側にて、単独プログラムを実行した結果をクライアントに表示

案2.
node.js で、シリアルポートを叩いた結果を JSON 形式で HTTP 応答する API を用意
"Web プログラム" の HTML 画面から AJAX にて API を呼び、結果を表示

案3.
node.js で、シリアルポートを叩いた結果を HTML 形式で HTTP 応答する "Web プログラム" を用意

QいきなりPDF2でP.Pointの変換時のエラーが多発

直ぐに回答が欲しいということで、金曜日にも質問しましたが回答が来ないので、再度質問させていただきます。P.Pointの変換時に、出力エラーや出力中止となります。そして、メッセージで多発しているのが、「この文書を開くときにエラーが発生しました。このファイルは開いているか、別のアプリケーションで使用中です。」変換元のファイルは開いていることも無く使用中でも有りません。数本購入して2台にインストールしましたが、全く利用できません。解決方法のアドバイスを宜しくお願い致します。

Aベストアンサー

単刀直入に

「ソースネクスト」を買った時点で「負けました」。。。

アンインストールして「Adobe Acrobat」の
[Acrobat 7.0 Elements 日本語版]
量販店で4000円台で売っています。

精神衛生上「ソースネクスト」はよろしくない。

因みに、私は大昔の「Acrobat 4.05」(?)を使い続けています。

QFireFoxの開発ツールでスクラッチパッドはdocument.writeは使えないのか

下記のhtmlでjavascriptは動きます。
<html>
<head>
<title>サンプル</title>
</head>
<body>
<script type="text/javascript">
<!--
document.write("<b>Hello World!!</b>");
// -->
</script>
</body>
</html>

然し、これと同じ事をFireFoxの開発ツールでのスクラッチパッドでは動きません。
document.write("<b>Hello World!!</b>");
↑を入力して実行させると、下記のエラーが出ます。何故なのだろうか。

/*
Exception: InvalidStateError: An attempt was made to use an object that is not, or is no longer, usable
@Scratchpad/1:10:0
*/

FireFoxでは、document.writeは使えないのか??
使えるとしたら、どこがおかしいのかを指摘願います。

下記のhtmlでjavascriptは動きます。
<html>
<head>
<title>サンプル</title>
</head>
<body>
<script type="text/javascript">
<!--
document.write("<b>Hello World!!</b>");
// -->
</script>
</body>
</html>

然し、これと同じ事をFireFoxの開発ツールでのスクラッチパッドでは動きません。
document.write("<b>Hello World!!</b>");
↑を入力して実行させると、下記のエラーが出ます。何故なのだろうか。

/*
Exception: InvalidStateError: An attempt was made to use an object that i...続きを読む

Aベストアンサー

http://oshiete.goo.ne.jp/qa/9084940.html で document.write("<b>Hello World!!</b>"); を実行可能な事を確認しました。
about:home や about:blank では使えませんが。

# Re: usui-2015さん

QMicrosoft Visual C++ Runtime Libraryというエラーが出るんですが・・・

HPのノートパソコンを最近購入したんですが、下記のようなエラーが出て困っています。
---------------------------
Microsoft Visual C++ Runtime Library
---------------------------
Buffer overrun detected!

Program: ...ckard\TouchSmart\Media\Kernel\CLML\CLMLSvc.exe

A buffer overrun has been detected which has corrupted the program's
internal state. The program cannot safely continue execution and must
now be terminated.

エラーは必ず出るというわけではなく、時々出るみたいです。
また、エラーのプログラムが表示されているんですが、「CLMLSvc.exe
」は検索しても出てきません。

PCのスペックは
機種:hp Pavilion Entertainment dv3000
OS:Windows Vista Home Premium
グラボ:NVIDIA GeForce 9300M GS

ブラウザはFirefoxでアンチウイルスソフトはF-Secureを使っています。
分かる方は是非回答お願いします

HPのノートパソコンを最近購入したんですが、下記のようなエラーが出て困っています。
---------------------------
Microsoft Visual C++ Runtime Library
---------------------------
Buffer overrun detected!

Program: ...ckard\TouchSmart\Media\Kernel\CLML\CLMLSvc.exe

A buffer overrun has been detected which has corrupted the program's
internal state. The program cannot safely continue execution and must
now be terminated.

エラーは必ず出るというわけではなく、時々出る...続きを読む

Aベストアンサー

プログラム内が不正に(破壊)されバッファーオーバーランを検出して、プログラムの実行を続けることができないので終了する。
というものです。
使用されているアンチウィルスソフトでは検出されないスパイウェア、アドウェアと呼ばれるもの(総称してマルウェアとも云う)が入り込んでいる可能性もありますので、チェックが必要と思います。
下記(英語サイト)のFree Scanでチェックが可能です。
http://www.liutilities.com/products/wintaskspro/processlibrary/clmlsvc/

適用されているアンチウィルスソフトはF-Secure一つだけですか。
Vistaでしたら、Microsoft Windows Defenderや悪意のあるソフトウェアの削除ツールなどが無償で適用可能ですが、入っていませんか。
無い場合は、Microsoft ダウンロードセンターから入手することができると思いますが。
スパイウェアの感染防止の面からは、無しに比べれば多少なりとも効果は有ると思います。私は、市販セキュリティソフトと共に、これらも併用しています。
 

プログラム内が不正に(破壊)されバッファーオーバーランを検出して、プログラムの実行を続けることができないので終了する。
というものです。
使用されているアンチウィルスソフトでは検出されないスパイウェア、アドウェアと呼ばれるもの(総称してマルウェアとも云う)が入り込んでいる可能性もありますので、チェックが必要と思います。
下記(英語サイト)のFree Scanでチェックが可能です。
http://www.liutilities.com/products/wintaskspro/processlibrary/clmlsvc/

適用されているアンチウィルス...続きを読む


人気Q&Aランキング

おすすめ情報